"id","e2b1","g1b1","i11","pcs1","mcs1","cesd1","indtot1","drugrisk1","sexrisk1","pcrec1","e2b2","g1b2","i12","pcs2","mcs2","cesd2","indtot2","drugrisk2","sexrisk2","pcrec2","e2b3","g1b3","i13","pcs3","mcs3","cesd3","indtot3","drugrisk3","sexrisk3","pcrec3","e2b4","g1b4","i14","pcs4","mcs4","cesd4","indtot4","drugrisk4","sexrisk4","pcrec4","a15a","a15b","d1","e2b","f1a","f1b","f1c","f1d","f1e","f1f","f1g","f1h","f1i","f1j","f1k","f1l","f1m","f1n","f1o","f1p","f1q","f1r","f1s","f1t","g1b","i1","i2","age","treat","homeless","pcs","mcs","cesd","indtot","pss_fr","drugrisk","sexrisk","satreat","drinkstatus","daysdrink","anysubstatus","daysanysub","linkstatus","dayslink","female","substance","racegrp"
1,,0,,54.2258262634277,52.2347984313965,7,5,0,1,1,,,,,,,,,,,,0,,52.0610618591309,56.0601005554199,8,0,0,1,2,,0,8,52.2728080749512,58.0414276123047,5,34,0,3,2,0,0,3,,3,2,3,0,2,3,3,0,2,3,3,0,1,2,2,2,2,3,3,2,1,13,26,37,1,0,58.413688659668,25.1119899749756,49,39,0,0,4,0,1,177,1,177,1,225,0,"cocaine","black"
2,,0,8,59.5606575012207,41.7269554138184,11,12,0,0,0,,,,,,,,,,,,,,,,,,,,,,,,,,,,,,,2,3,22,,3,2,0,3,3,2,0,0,3,0,3,0,0,3,0,0,0,2,0,0,1,56,62,37,1,1,36.0369415283203,26.6703071594238,30,43,1,0,7,0,1,2,1,2,,,0,"alcohol","white"
3,,0,,58.4577713012695,56.7713050842285,14,99,13,4,0,,,,,,,,,,,,,,,,,,,,,2,0,3,66.2438735961914,13.550651550293,49,94,19,4,0,0,0,0,,3,2,3,0,2,2,1,3,2,3,1,0,1,3,2,0,0,3,2,0,0,0,0,26,0,0,74.8063278198242,6.76292324066162,39,41,13,20,2,0,1,3,1,3,0,365,0,"heroin","black"
4,,0,,46.6098785400391,14.6592464447021,44,97,0,4,0,1,,,57.5609169006348,23.9131622314453,,,,,0,,,,,,,,,,,,0,,57.0544357299805,53.4505805969238,20,5,0,4,0,0,0,2,1,0,0,1,3,2,2,1,3,0,0,1,2,2,2,0,,2,0,0,1,0,5,5,39,0,0,61.9316787719727,43.9678802490234,15,28,11,0,4,1,0,196,1,189,0,343,1,"heroin","white"
5,,0,64,31.4164218902588,40.6742095947266,26,55,0,4,0,,0,,44.8334045410156,42.4446868896484,27,34,0,2,0,1,0,13,25.0262508392334,50.9347686767578,15,37,0,4,0,,0,6,44.6591835021973,32.7239151000977,28,58,0,2,0,15,0,12,1,3,0,3,3,3,3,1,3,3,2,3,2,2,3,0,3,3,3,3,3,0,10,13,32,0,1,37.3455848693848,21.6757545471191,39,38,10,0,6,0,1,2,1,2,1,57,0,"cocaine","black"
6,,0,1,43.2049522399902,50.0591697692871,23,12,0,4,0,,,,,,,,,,,,,,,,,,,,,,,,,,,,,,,0,0,1,,1,0,1,3,0,0,0,3,0,1,1,3,1,0,1,3,0,0,0,0,0,4,4,47,1,0,46.475212097168,55.5089912414551,6,29,5,0,5,0,1,31,1,31,0,365,1,"cocaine","black"
7,,,,,,,,,,,1,0,13,31.595401763916,23.1517639160156,47,92,0,9,2,,0,13,25.9679756164551,25.6222629547119,54,104,0,7,2,1,0,,24.626184463501,29.8987789154053,52,113,0,7,2,0,0,14,1,3,1,3,1,3,3,3,1,3,3,3,0,0,3,3,1,3,3,3,3,1,13,20,49,0,0,24.5150394439697,21.7930240631104,52,38,1,0,8,1,,,,,0,334,1,"cocaine","black"
8,1,0,,63.9199104309082,36.0635871887207,18,82,0,4,0,,,,,,,,,,,2,0,12,57.4673461914062,40.6260299682617,25,92,6,6,0,,,,,,,,,,,4,1,1,8,1,1,2,3,3,3,3,1,1,0,3,1,3,0,1,0,2,2,0,0,1,12,24,28,1,1,65.1380081176758,9.16053009033203,32,44,4,7,6,1,1,47,1,47,0,365,0,"alcohol","white"
9,1,0,12,45.5560874938965,28.8762722015381,33,92,8,4,0,,,,,,,,,,,4,0,27,58.526195526123,24.2233695983887,35,88,7,8,2,,0,9,45.4113464355469,27.7050952911377,27,93,0,3,2,1,134,14,7,3,2,3,1,3,3,3,0,3,3,3,1,2,3,2,0,1,3,1,2,0,71,129,50,0,1,38.2708778381348,22.0296783447266,50,44,5,18,8,0,1,62,1,31,0,365,1,"alcohol","white"
10,1,0,13,53.2367248535156,15.7986297607422,37,104,14,5,2,2,0,22,24.4735870361328,27.9554386138916,47,100,19,0,2,,,,,,,,,,,,,,,,,,,,,4,20,4,3,2,3,3,0,1,2,3,0,3,1,3,0,3,3,1,0,0,3,0,3,0,20,27,39,1,1,22.6105976104736,36.1437606811523,46,44,0,20,0,1,1,115,1,115,0,382,0,"heroin","white"
11,,,,,,,,,,,,,,,,,,,,,,,,,,,,,,,,0,,60.3994598388672,52.280330657959,25,42,6,3,2,0,0,0,,2,3,2,0,2,1,2,0,3,2,2,2,2,3,2,0,2,2,3,3,0,0,0,34,1,0,60.0791549682617,43.9746780395508,46,34,0,8,2,0,,,,,0,365,1,"heroin","white"
12,,0,,52.9610824584961,51.4522018432617,8,0,0,0,0,,,,,,,,,,,,,,,,,,,,,,,,,,,,,,,0,0,3,,3,2,3,1,3,3,3,0,3,0,3,0,3,0,3,0,3,3,0,3,0,13,13,58,0,0,41.9337615966797,13.3822050094604,49,11,13,0,0,1,0,192,0,192,0,365,1,"alcohol","black"
14,2,0,13,35.973575592041,50.7842216491699,37,88,0,2,0,,,,,,,,,,,1,0,19,46.1927337646484,56.5963439941406,13,71,0,1,0,,,,,,,,,,,0,1,5,,2,0,1,3,2,0,1,3,2,0,0,1,2,2,0,0,0,1,2,2,0,20,31,58,0,1,39.2426414489746,49.0893020629883,22,40,13,0,1,1,1,6,1,6,0,365,0,"alcohol","white"
15,,0,6,41.9966621398926,48.6987648010254,3,17,0,3,2,,,,,,,,,,,1,0,6,27.379903793335,40.792163848877,20,38,0,3,2,,0,,27.201847076416,47.0786247253418,15,67,0,2,2,5,10,10,1,3,3,3,3,3,0,3,1,1,0,0,0,3,3,0,0,0,3,0,3,0,13,20,60,1,1,31.8296489715576,25.8461570739746,36,41,1,0,4,0,1,6,1,6,1,22,0,"cocaine","black"
16,1,0,,52.2822532653809,44.3333053588867,24,85,0,8,1,,0,,43.1741600036621,62.0275573730469,3,36,0,5,1,,,,,,,,,,,,,,,,,,,,,0,0,2,,3,3,2,3,3,2,2,0,1,1,3,0,2,2,3,0,2,2,1,2,0,51,51,36,1,0,55.1699752807617,23.6084442138672,43,38,1,0,8,0,1,0,1,0,0,443,0,"alcohol","white"
17,4,0,,52.6948089599609,46.5867691040039,19,83,0,6,0,1,1,,45.798526763916,42.7288360595703,25,45,0,4,,1,1,,65.4901809692383,18.7049865722656,38,4,0,4,2,2,1,38,36.6984786987305,30.3804416656494,35,72,2,3,2,83,2,6,2,2,2,2,0,0,3,2,0,2,0,2,1,1,1,0,0,2,2,2,1,1,0,0,28,1,1,44.7765121459961,29.7998275756836,35,26,7,0,3,1,0,183,1,27,1,41,1,"heroin","hispanic"
18,,0,,58.3376731872559,39.1293907165527,7,30,0,5,0,,0,,58.3436164855957,58.8745155334473,11,27,0,5,1,,0,,60.7108306884766,49.7732200622559,10,4,0,0,1,,,,,,,,,,,0,0,1,,2,0,2,1,3,0,0,0,0,,2,3,3,2,0,3,0,0,0,0,0,0,0,35,0,0,56.4383697509766,42.1664619445801,19,17,9,0,4,0,0,181,1,2,0,405,0,"heroin","black"
19,,0,,59.2439079284668,41.5549545288086,25,0,0,0,0,2,0,1,59.8301773071289,42.7288627624512,12,10,0,5,0,,0,,55.6589851379395,45.9544830322266,20,0,0,3,0,,,,,,,,,,,0,4,2,1,0,0,3,1,2,3,2,0,3,3,0,0,1,3,2,0,0,3,2,2,1,1,1,29,0,1,58.2980728149414,16.732292175293,40,40,1,0,4,0,0,220,0,220,0,449,0,"cocaine","other"
20,,0,,61.4024543762207,41.5303039550781,15,4,0,3,2,,0,,59.6147270202637,48.9206619262695,8,14,0,3,2,,0,,58.8506660461426,52.857666015625,4,1,0,3,2,,0,,53.3872184753418,52.7770500183105,1,0,0,,2,0,0,0,4,1,3,3,0,2,3,3,0,3,3,3,1,1,3,2,0,3,3,3,2,1,9,24,27,1,0,37.4521369934082,15.4582710266113,52,37,13,10,3,0,0,198,0,198,1,49,1,"heroin","white"
21,,0,,68.6264190673828,24.0385818481445,24,31,0,2,0,,0,,60.5640754699707,42.7719345092773,12,14,0,4,0,,,,,,,,,,,,0,,29.2695636749268,59.8419609069824,27,62,0,5,0,0,0,1,,3,2,1,1,2,2,1,2,3,1,3,2,3,3,1,1,0,2,3,1,0,23,23,27,0,0,34.3392601013184,55.1281089782715,37,37,11,0,7,1,1,52,1,52,0,367,0,"cocaine","black"
22,,,,,,,,,,,2,0,9,46.3399887084961,20.6568031311035,42,106,10,5,2,,,,,,,,,,,,0,,53.398754119873,40.9340133666992,27,123,13,8,2,0,0,1,1,0,2,3,1,3,2,3,3,3,1,3,0,0,1,2,1,0,1,1,3,0,26,26,41,1,0,36.5848121643066,20.8714466094971,35,36,8,12,4,0,,,,,0,391,0,"heroin","black"
23,1,0,,58.6032257080078,52.8732452392578,15,80,0,7,1,,,,,,,,,,,,0,,45.8741645812988,49.9475173950195,14,0,0,4,2,,0,,57.9075889587402,50.209774017334,4,0,0,4,2,0,0,1,,1,3,1,3,0,0,1,3,0,2,3,3,2,1,2,2,0,0,1,0,0,0,0,33,1,0,61.6409797668457,47.2867393493652,18,27,14,0,4,0,0,243,1,129,1,272,0,"cocaine","black"
24,,,,,,,,,,,1,0,,47.7855796813965,45.352710723877,17,82,11,2,0,,0,12,51.4153175354004,40.6482391357422,29,77,9,5,2,2,1,26,30.7813663482666,41.5675964355469,29,82,1,4,2,150,0,4,2,1,2,3,1,2,3,1,1,3,3,2,0,1,1,0,0,1,1,1,1,1,34,34,34,0,1,46.2217636108398,19.6205959320068,36,42,10,0,6,0,,,,,0,293,0,"alcohol","white"
25,1,0,5,58.2175559997559,31.7568168640137,16,99,0,5,0,1,0,,61.816535949707,39.9758567810059,8,102,0,2,1,1,0,5,57.1551284790039,38.6432495117188,11,116,0,5,1,1,0,,54.2662391662598,40.898323059082,7,62,0,6,1,0,5,2,3,1,0,0,1,2,0,0,1,2,3,3,0,2,3,0,1,0,2,0,1,0,4,5,31,0,1,51.5632362365723,44.4421043395996,28,42,6,0,9,1,1,6,1,3,0,428,0,"cocaine","black"
27,,0,,40.790470123291,26.7847099304199,20,7,1,4,2,,,,,,,,,,,,,,,,,,,,,,,,,,,,,,,0,0,4,,2,0,1,3,2,0,3,3,2,0,3,1,3,0,0,3,0,1,0,0,0,6,8,48,0,0,36.0100746154785,21.6684741973877,19,40,6,0,7,0,1,67,1,67,0,365,1,"cocaine","black"
28,,0,3,58.8337173461914,57.7956504821777,2,13,0,2,0,,,,,,,,,,,,,,,,,,,,,,,,,,,,,,,0,0,1,,0,0,3,0,0,3,0,0,3,0,3,0,0,3,0,0,0,3,0,0,0,3,3,34,1,0,63.06005859375,37.3715553283691,30,34,3,0,5,0,1,154,1,154,1,56,0,"cocaine","white"
30,1,0,,59.4770126342773,15.5962858200073,44,117,1,4,0,,0,,59.1359481811523,57.2084426879883,5,0,0,0,0,,0,,58.5079956054688,57.1596298217773,0,0,0,4,0,,0,,58.5769233703613,57.7234687805176,0,9,0,3,0,10,10,0,,1,0,1,2,0,3,2,0,0,1,3,0,1,0,3,0,0,0,1,1,0,7,7,35,1,1,61.8259735107422,34.3356666564941,27,37,6,1,4,0,1,34,1,34,0,361,0,"heroin","black"
31,,0,,25.602481842041,50.4345283508301,18,25,0,4,0,,,,,,,,,,,,,,,,,,,,,,,,,,,,,,,0,0,0,,2,0,1,3,1,1,0,1,2,1,3,1,0,2,0,0,0,2,0,2,1,24,48,34,0,0,43.5337409973145,46.3407554626465,24,41,4,0,5,0,0,204,0,204,0,365,0,"alcohol","white"
32,2,0,,35.3714942932129,44.04345703125,41,56,0,3,2,,,,,,,,,,,,,,,,,,,,,8,0,12,46.4011878967285,31.5070114135742,27,71,0,2,2,3,10,1,3,2,2,3,0,2,2,2,1,3,3,3,0,2,3,1,0,0,2,3,3,0,0,0,29,1,1,42.2249031066895,27.7177104949951,47,37,5,0,2,1,1,142,1,142,1,79,0,"cocaine","black"
33,,0,,54.7972297668457,56.2663116455078,2,6,0,3,0,,0,,59.8460655212402,47.1333808898926,11,0,0,3,0,,0,,58.2746887207031,58.310676574707,1,0,0,2,0,,0,,55.302074432373,57.4067420959473,4,2,0,2,1,4,7,2,,3,3,3,1,3,3,3,2,2,2,3,1,3,3,1,2,2,2,1,2,0,20,20,35,0,1,42.4005928039551,18.9843235015869,45,44,3,0,6,0,0,189,0,189,0,364,0,"alcohol","black"
34,,0,,53.3273277282715,58.5790748596191,19,68,0,5,0,,,,,,,,,,,,0,,60.6436157226562,52.3747901916504,17,46,0,1,0,,0,6,50.8254432678223,14.9472332000732,23,109,0,6,0,46,14,10,,1,0,1,3,3,1,1,3,0,0,3,3,3,3,0,3,0,1,1,0,0,3,3,43,0,1,50.1469993591309,58.2412643432617,18,41,12,0,0,0,0,270,1,4,0,365,0,"alcohol","black"
35,,0,,67.242073059082,7.26827001571655,35,3,0,1,0,,0,3,55.6454696655273,62.2767562866211,11,,,,0,1,0,4,71.2912979125977,15.3100328445435,21,,0,5,0,,0,2,56.8902740478516,57.1731262207031,16,1,0,0,1,7,0,0,,0,0,1,3,1,0,2,3,0,1,3,1,0,0,0,3,0,0,0,1,0,6,6,37,1,1,63.5200042724609,27.8526077270508,11,35,2,3,5,1,0,203,0,203,1,203,0,"cocaine","black"
36,,0,,57.8987426757812,57.2863311767578,26,2,0,0,0,,0,,58.145622253418,50.3553352355957,19,2,0,0,0,2,0,32,67.5434646606445,13.3907461166382,36,72,0,1,0,1,0,76,58.3886260986328,54.1998062133789,44,40,0,1,0,0,0,1,,0,2,1,1,2,2,1,2,1,1,2,1,1,1,1,2,1,1,1,2,0,0,0,29,1,0,53.3510932922363,54.7743492126465,26,21,10,0,2,0,0,193,0,193,0,354,0,"cocaine","black"
37,1,0,,59.7633438110352,50.3418350219727,27,75,0,3,1,,,,,,,,,,,,,,,,,,,,,,,,,,,,,,,0,0,1,,3,0,0,3,1,3,0,0,3,2,3,0,0,3,0,1,0,3,0,0,0,0,0,33,1,0,56.7398490905762,27.4954814910889,29,30,10,0,0,0,1,17,1,10,1,29,0,"cocaine","black"
38,,0,11,55.1892738342285,53.4796562194824,10,1,0,1,1,,,,,,,,,,,,,,,,,,,,,,,,,,,,,,,1,90,1,,1,1,2,1,3,1,1,1,0,2,1,1,2,2,3,1,0,2,2,3,0,32,135,20,1,1,53.2339630126953,56.324333190918,34,33,8,0,3,0,1,177,1,177,0,365,0,"alcohol","black"
39,,0,,57.2501182556152,56.4257698059082,9,0,0,4,1,,,,,,,,,,,,,,,,,,,,,,,,,,,,,,,0,0,2,3,1,0,3,1,3,3,1,2,3,3,3,0,2,3,0,1,1,3,0,0,0,2,24,38,0,0,62.0411338806152,37.0060424804688,37,43,6,0,4,0,0,195,0,195,0,365,0,"alcohol","white"
40,1,0,6,40.5535888671875,39.0430374145508,27,79,4,4,0,,,,,,,,,,,,,,,,,,,,,,,,,,,,,,,0,0,0,2,1,1,0,3,1,1,2,0,1,1,3,0,2,0,0,1,0,1,0,1,0,3,3,28,0,0,38.3952941894531,39.8977737426758,23,41,11,1,4,0,1,9,1,7,0,365,0,"heroin","black"
41,,,,,,,,,,,,,,,,,,,,,,,,,,,,,,,3,1,,39.4511947631836,26.7116928100586,37,84,4,9,2,0,3,1,1,1,0,3,2,1,3,2,2,3,2,2,0,2,3,2,2,3,2,1,2,0,24,32,18,1,1,34.2882537841797,25.1955699920654,38,36,8,0,3,0,,,,,0,365,1,"missing","other"
42,2,0,,58.424690246582,18.5407409667969,35,77,0,1,1,,,,,,,,,,,,,,,,,,,,,,,,,,,,,,,180,0,7,3,2,0,3,0,2,3,2,1,3,1,2,1,2,3,3,1,0,3,2,1,1,27,27,33,0,1,51.303295135498,18.6405944824219,41,41,1,0,0,1,1,14,1,14,0,365,0,"alcohol","white"
43,,,,,,,,,,,,,,,,,,,,,,,,,,,,,,,11,0,,58.717227935791,32.7166175842285,10,80,11,4,0,0,0,0,,2,2,1,3,2,1,1,3,1,1,1,2,2,2,0,1,0,1,0,1,0,3,7,40,0,0,56.6838874816895,45.1340980529785,21,32,10,1,4,0,,,,,0,365,0,"heroin","hispanic"
44,,0,,54.608470916748,53.018383026123,11,24,0,0,0,2,0,60,50.7871398925781,11.6472520828247,49,91,0,3,0,,,,,,,,,,,,0,31,63.3623733520508,32.6828842163086,28,50,0,0,0,0,3,15,,1,0,0,3,3,1,0,2,0,0,2,3,2,0,3,1,0,0,1,0,0,24,36,43,1,1,71.3925933837891,15.8619241714478,16,41,3,0,7,0,0,191,0,191,0,414,0,"cocaine","white"
45,2,0,,51.5736846923828,22.0313205718994,31,107,0,7,0,,0,,60.5554084777832,35.5442314147949,17,12,0,0,0,2,0,,63.8160591125488,26.6342258453369,24,91,0,4,0,,0,,65.2547454833984,25.1512966156006,23,16,0,0,0,2,3,1,,2,3,3,0,3,2,0,0,2,1,3,0,0,1,0,0,1,2,0,1,0,6,12,28,1,1,52.6197738647461,24.1488151550293,36,39,4,0,7,0,1,31,1,31,0,414,0,"cocaine","black"
46,5,0,,35.5551528930664,37.0969085693359,22,0,0,7,2,,0,,41.984302520752,34.5645027160645,14,3,0,3,2,,0,,28.5519485473633,43.5868606567383,21,0,0,3,2,,0,,36.3792266845703,46.3596649169922,23,0,0,3,2,3,0,2,2,2,0,0,0,2,0,0,2,0,0,3,3,0,1,2,3,3,0,0,0,0,0,0,45,0,1,36.0458755493164,29.9016246795654,17,22,7,0,6,0,0,174,0,174,1,43,0,"cocaine","black"
47,,0,,58.4689636230469,44.1428146362305,13,21,7,4,1,1,0,,39.9245262145996,30.6802196502686,41,59,0,5,1,,0,,42.0738182067871,32.5761528015137,29,0,0,1,2,,0,,53.1709594726562,33.5660934448242,22,34,0,2,2,0,0,2,,3,2,3,1,2,2,1,1,3,2,1,1,1,2,0,1,1,2,2,1,0,13,13,42,1,0,50.064266204834,29.4129772186279,36,39,14,7,4,0,1,33,1,17,1,38,0,"heroin","white"
49,,,,,,,,,,,,,,,,,,,,,,,,,,,,,,,1,0,,59.2548866271973,56.152946472168,14,100,0,6,0,1,0,0,,0,0,1,3,2,0,3,3,2,1,3,2,0,0,2,3,0,0,3,1,0,25,28,30,0,1,62.0318298339844,35.2069702148438,19,38,10,0,5,0,,,,,1,264,0,"alcohol","black"
50,,0,,50.458553314209,62.764232635498,11,10,0,0,1,,,,,,,,,,,,,,,,,,,,,,,,,,,,,,,0,0,2,,0,1,0,3,0,0,0,2,0,0,0,3,0,0,0,0,0,0,0,0,0,6,13,34,1,0,52.6989784240723,59.4540939331055,5,8,12,0,4,0,1,23,1,23,1,14,1,"cocaine","black"
51,1,0,,55.8807640075684,51.9607734680176,9,0,0,1,0,,0,,56.2903747558594,57.3875885009766,0,0,0,1,2,,0,,54.494140625,57.9805030822754,0,0,0,1,2,,0,,55.7406997680664,57.9903717041016,0,0,0,1,2,0,0,2,,3,1,2,0,0,2,3,1,0,1,0,2,1,2,0,1,1,1,0,0,0,13,61,36,0,0,56.3866882324219,20.9998931884766,25,36,12,0,1,0,1,2,1,2,0,377,0,"alcohol","black"
52,,,,,,,,,,,1,0,32,43.0966148376465,35.0690879821777,30,,19,4,2,,,,,,,,,,,2,0,23,33.2862319946289,33.911750793457,40,90,18,6,2,2,2,5,1,3,1,1,1,0,3,1,1,1,1,3,0,2,1,1,0,2,3,2,1,1,15,26,44,1,1,40.3843765258789,29.3902797698975,36,42,11,19,10,0,,,,,0,321,0,"heroin","black"
53,1,0,1,58.9646034240723,48.7467994689941,9,43,0,6,0,1,0,,53.5600242614746,56.3442001342773,6,33,0,5,1,,0,,56.7804756164551,56.308723449707,11,1,0,3,2,,0,2,56.5567359924316,59.5551872253418,3,4,0,3,2,0,0,0,,0,3,1,2,1,1,2,1,1,2,1,1,2,2,0,0,1,1,0,1,1,7,7,41,0,0,58.1616897583008,26.7732791900635,27,31,6,0,6,0,1,30,1,30,,,0,"cocaine","black"
54,,0,,59.4004554748535,43.4057197570801,20,0,0,4,2,,0,,56.9698028564453,55.7739067077637,16,0,0,4,2,,,,,,,,,,,2,0,,38.1583786010742,27.3106231689453,31,93,13,6,2,0,30,2,2,1,1,3,0,0,3,1,3,3,3,1,0,3,3,1,0,3,3,3,3,1,9,15,30,1,1,45.4834060668945,17.9252510070801,44,44,6,21,9,0,0,209,0,209,1,26,0,"heroin","other"
56,,0,,58.7315139770508,51.9055061340332,19,36,0,6,0,,,,,,,,,,,,0,,59.6440315246582,47.1331176757812,17,59,0,4,0,1,0,2,53.8072891235352,57.0865211486816,2,47,0,6,0,150,3,2,,2,1,1,3,1,1,1,2,2,2,2,1,1,3,3,0,1,1,0,1,0,5,13,37,1,1,63.0580711364746,34.4346961975098,29,40,2,0,7,0,0,181,1,111,1,18,0,"alcohol","black"
57,2,0,,55.5697860717773,53.5440483093262,13,99,0,3,2,,,,,,,,,,,,0,9,44.7919883728027,60.6080627441406,22,21,0,2,2,,0,6,52.9672431945801,52.6178321838379,19,32,0,1,2,0,0,3,,2,1,3,0,1,3,0,0,3,3,2,1,1,3,1,0,3,3,3,3,0,13,20,35,1,0,46.750862121582,24.0003147125244,46,32,1,0,7,0,1,17,1,17,0,365,1,"cocaine","black"
58,1,0,4,26.7960948944092,63.0392417907715,5,20,0,4,1,1,0,19,18.5544815063477,60.6611175537109,20,42,0,3,2,1,0,26,29.0597190856934,32.0967178344727,30,54,0,3,2,2,0,55,31.6509628295898,55.5569229125977,30,28,0,2,2,0,0,5,,0,2,1,3,1,0,3,3,0,0,3,3,0,0,3,3,1,1,0,1,1,34,34,37,0,0,29.4562492370605,47.6719360351562,16,29,8,0,3,0,1,137,1,137,1,171,0,"alcohol","white"
59,2,1,4,37.5216751098633,27.7904567718506,27,84,0,7,2,,1,3,26.4415664672852,41.5802955627441,24,53,0,2,2,,0,,26.3262767791748,45.163948059082,29,80,0,2,2,,0,,24.320125579834,50.4635963439941,16,24,0,0,2,0,0,1,,3,2,1,1,2,3,2,0,3,3,3,0,3,2,1,0,1,3,0,1,1,3,6,44,1,0,40.4605598449707,26.6530361175537,44,44,13,0,4,0,1,4,1,4,1,27,0,"cocaine","other"
60,9,0,37,44.9130935668945,25.6471519470215,42,77,0,0,0,7,0,30,56.8545799255371,41.592098236084,42,87,0,6,2,6,0,25,50.2371864318848,33.3362197875977,29,75,0,0,2,5,0,,54.6826934814453,34.9445571899414,25,48,0,0,2,20,10,2,4,0,0,1,0,1,2,2,0,3,2,2,0,3,3,2,0,1,3,2,3,1,37,43,47,0,1,57.2021293640137,28.4692726135254,42,43,1,0,2,1,1,3,1,3,1,190,0,"alcohol","white"
61,1,0,74,58.6721534729004,53.437084197998,11,37,0,2,1,3,0,,32.6020927429199,45.9780883789062,16,21,1,5,1,1,0,31,63.5544357299805,42.4729156494141,14,27,1,4,1,,0,31,58.9291648864746,55.5169258117676,5,24,0,2,1,2,40,5,2,2,1,1,3,0,2,0,2,3,2,2,1,2,3,2,1,1,2,0,2,0,36,36,38,1,1,47.6051445007324,26.0657768249512,30,38,10,0,4,0,1,18,1,18,1,30,0,"alcohol","black"
62,,0,,55.8940048217773,47.9688453674316,22,52,0,8,1,,,,,,,,,,,,,,,,,,,,,2,0,6,57.9393997192383,55.5792350769043,7,40,1,7,1,0,0,0,,1,0,2,3,2,1,3,1,2,0,1,2,2,3,1,3,0,2,0,2,1,13,15,37,0,0,50.1631813049316,31.5017108917236,25,34,7,1,6,1,1,2,1,2,0,365,0,"heroin","black"
63,3,0,7,59.8748970031738,56.3197402954102,36,103,0,5,0,,,,,,,,,,,1,0,,69.933967590332,24.7302703857422,36,112,0,3,0,,,,,,,,,,,0,0,1,11,1,3,2,3,2,1,0,1,2,1,0,0,2,3,0,3,3,1,0,0,0,3,19,34,0,0,50.3987007141113,24.998929977417,26,41,6,0,7,1,1,1,1,1,0,365,0,"cocaine","black"
65,,0,,52.7996597290039,51.0358924865723,6,0,0,2,2,,0,,59.3503341674805,53.8742218017578,3,0,0,1,2,,0,,47.4101257324219,47.6224784851074,4,0,0,4,2,,0,,58.4530906677246,30.0688343048096,16,0,0,0,2,0,0,3,2,1,0,0,0,1,3,2,0,2,1,2,0,0,1,0,0,1,2,0,1,1,3,6,41,1,0,55.233715057373,33.3741722106934,29,20,13,0,4,1,0,181,0,181,1,19,1,"alcohol","white"
66,,0,,56.6109809875488,36.1004028320312,22,41,0,4,2,,,,,,,,,,,,0,,42.1125564575195,54.5163612365723,15,0,0,7,2,,1,,58.6664390563965,36.5966148376465,22,0,0,,2,10,0,3,4,0,1,3,2,3,3,1,0,1,1,2,2,2,1,1,0,3,3,0,0,1,0,0,29,0,1,35.124698638916,27.57546043396,33,29,4,1,4,1,0,180,0,180,0,365,1,"heroin","hispanic"
67,,0,26,59.8918495178223,51.3817558288574,17,57,0,7,0,,0,,63.9354400634766,30.4910430908203,30,35,0,4,0,,,,,,,,,,,1,0,26,54.5402755737305,43.741756439209,32,72,0,8,2,0,0,1,1,1,1,2,3,1,1,1,1,2,2,2,2,3,2,1,1,0,2,1,1,0,32,32,35,1,0,52.6887054443359,35.8396415710449,28,38,12,0,6,1,1,36,1,36,0,400,0,"cocaine","black"
68,,,,,,,,,,,,,,,,,,,,,,,,,,,,,,,1,0,,52.19970703125,57.5137062072754,0,84,0,5,2,0,0,0,1,1,2,3,2,3,3,2,3,3,2,3,0,1,3,0,1,0,1,0,0,0,35,42,36,0,0,67.5362548828125,17.5652351379395,33,42,11,0,4,1,,,,,0,365,0,"alcohol","black"
69,,0,,54.836181640625,32.5052909851074,18,6,0,4,0,,0,19,49.9604797363281,48.7594985961914,22,34,0,4,0,2,0,19,47.8612632751465,23.1430778503418,32,75,0,8,0,,,,,,,,,,,0,1,3,1,2,1,3,0,1,2,3,1,2,2,3,0,1,3,2,0,0,3,2,3,1,20,20,27,0,1,36.9805793762207,20.0253410339355,44,41,5,0,6,0,0,252,0,252,0,431,0,"alcohol","white"
70,,0,,49.0141487121582,47.8424301147461,15,10,0,6,2,,0,4,52.9993858337402,55.6154022216797,12,34,0,6,2,,0,3,41.7343559265137,21.3245792388916,38,53,0,7,2,,0,3,35.722770690918,32.3089904785156,32,51,0,7,2,4,2,1,1,1,0,3,2,0,3,1,2,2,2,1,1,1,3,3,1,0,2,1,0,0,7,25,36,0,1,64.2902221679688,25.8125915527344,29,38,5,0,9,1,0,195,0,195,1,195,0,"alcohol","black"
71,,0,,58.1833038330078,52.4651298522949,8,3,0,0,2,1,0,6,60.6293487548828,27.7362461090088,35,48,0,1,2,,,,,,,,,,,,,,,,,,,,,10,38,5,,3,3,3,0,3,3,0,0,3,3,3,0,3,3,3,0,3,3,3,3,1,59,164,40,1,1,36.0401573181152,17.7059631347656,57,43,1,0,4,0,0,181,0,181,1,34,1,"alcohol","black"
72,,,,,,,,,,,,,,,,,,,,,,,,,,,,,,,,0,,49.7201080322266,53.7733497619629,17,0,0,4,1,0,0,4,,0,1,2,3,0,1,0,2,2,0,3,1,3,3,3,1,1,1,1,0,0,0,0,38,1,0,53.1568641662598,39.9341621398926,26,38,8,1,2,1,,,,,1,133,0,"heroin","white"
73,3,0,43,48.1606063842773,27.172700881958,40,117,11,6,2,1,0,22,58.2172775268555,18.7936477661133,32,98,8,0,2,,,,,,,,,,,1,0,,47.6210289001465,27.1677856445312,24,112,8,0,2,173,7,2,3,1,2,3,0,1,2,1,0,3,0,1,1,0,1,1,0,0,1,1,2,0,26,51,42,1,1,45.1849899291992,23.9967250823975,31,44,3,8,6,1,1,107,1,103,1,48,0,"alcohol","white"
74,,,,,,,,,,,,,,,,,,,,,,,,,,,,,,,,0,6,57.0971298217773,43.2318840026855,22,33,0,3,2,0,0,4,,0,1,1,2,1,2,1,2,2,2,1,1,2,2,1,2,3,3,2,1,1,12,18,26,0,0,54.3827247619629,26.6972618103027,30,37,6,0,9,0,,,,,,,1,"cocaine","white"
75,1,0,,59.4881896972656,55.0018997192383,1,102,4,4,2,1,0,,59.5571174621582,55.5657386779785,2,8,0,4,2,,,,,,,,,,,,,,,,,,,,,0,0,0,,2,2,3,2,3,3,2,1,3,3,3,0,2,3,0,1,2,3,0,1,0,0,0,41,0,0,55.3218879699707,15.4477939605713,43,40,14,10,3,0,0,194,1,2,,,1,"heroin","white"
76,,0,,34.7247276306152,43.8713264465332,17,48,0,4,0,,,,,,,,,,,,0,,34.155891418457,34.391960144043,22,30,0,3,0,,0,5,49.943920135498,41.3691940307617,19,82,0,1,0,0,0,10,,2,1,3,3,3,2,3,3,0,1,3,1,1,2,1,3,0,2,1,1,0,18,36,43,1,0,27.3666286468506,38.7521018981934,28,38,4,0,5,0,1,78,1,78,0,365,0,"cocaine","black"
77,,,,,,,,,,,,,,,,,,,,,,0,,64.0810089111328,28.5960865020752,30,7,0,4,0,,,,,,,,,,2,0,0,7,,2,3,2,0,2,2,1,1,3,3,3,1,1,3,0,1,3,3,3,0,1,0,0,30,1,0,39.9463386535645,25.9525833129883,43,,9,8,4,0,,,,,0,365,1,"heroin","white"
78,2,0,,59.8693237304688,29.7891273498535,22,38,0,0,0,,,,,,,,,,,,,,,,,,,,,,,,,,,,,,,0,0,3,2,1,0,2,3,2,3,2,3,3,2,0,2,1,3,2,1,0,2,1,2,0,6,12,28,0,0,58.2589454650879,34.8399620056152,29,29,5,0,8,0,1,9,1,9,1,129,0,"cocaine","white"
80,,0,13,57.9908142089844,54.1656379699707,13,13,0,0,0,,0,1,55.9588966369629,49.0610580444336,9,21,0,8,0,,0,10,57.2911376953125,43.3403358459473,24,35,0,7,0,,,,,,,,,,,0,0,2,,0,0,3,3,1,3,3,0,3,3,3,0,0,3,0,2,0,3,0,0,0,13,17,30,0,0,63.9136657714844,22.9572353363037,32,35,10,3,12,0,1,53,1,53,,,0,"cocaine","white"
81,,,,,,,,,,,,0,2,61.0210952758789,37.7232131958008,25,55,0,5,0,,1,2,61.3869361877441,36.8728561401367,43,64,0,3,0,1,0,,57.6917419433594,53.5871543884277,12,4,0,2,0,180,0,4,,1,0,3,2,1,2,2,1,3,1,0,2,2,2,2,2,1,1,3,1,1,5,5,42,1,1,56.904411315918,28.4180030822754,30,28,2,0,4,0,,,,,1,35,0,"cocaine","black"
82,2,0,,57.1018409729004,30.0217628479004,42,98,0,7,0,3,0,4,50.0692901611328,55.5669860839844,16,39,0,4,0,,0,,62.4415550231934,32.4998588562012,27,90,0,8,0,,,,,,,,,,,1,0,7,1,3,0,3,1,3,3,2,3,3,1,0,1,0,0,3,3,3,2,1,3,0,2,2,22,0,1,48.7913627624512,33.1159133911133,34,31,4,0,9,0,1,4,1,4,0,365,0,"heroin","black"
83,,,,,,,,,,,2,,,39.7574920654297,22.5724449157715,,,,,2,,,,,,,,,,,,,,,,,,,,,7,28,2,1,2,3,3,1,3,3,2,2,2,3,3,0,1,3,1,1,3,3,3,3,0,102,102,31,0,1,52.5937995910645,14.9139251708984,49,40,9,3,6,1,,,,,0,439,0,"cocaine","black"
84,,0,,59.3943862915039,43.2079238891602,14,21,0,4,2,,0,,56.6874465942383,53.4378280639648,17,5,0,4,2,,0,,57.5082511901855,44.3010940551758,18,4,0,4,2,,0,,54.8337669372559,41.3205757141113,18,12,0,0,2,14,5,0,3,0,0,3,2,2,3,3,2,3,3,0,1,2,2,2,1,1,3,2,1,1,0,0,30,1,1,68.1239547729492,17.449857711792,36,44,7,0,6,1,0,177,0,177,1,44,0,"alcohol","white"
85,,,,,,,,,,,,,,,,,,,,,2,0,7,33.9388580322266,49.4676666259766,16,103,1,4,0,,,,,,,,,,,0,0,1,1,1,2,3,1,3,3,3,2,1,3,3,1,3,3,1,2,1,3,1,2,1,21,21,25,0,0,57.0777740478516,13.1346626281738,42,36,1,1,3,0,,,,,0,365,0,"heroin","hispanic"
86,,1,4,55.5110015869141,24.9953804016113,38,37,1,5,1,,,,,,,,,,,,,,,,,,,,,,,,,,,,,,,0,14,1,,1,1,3,3,0,3,2,1,2,2,3,0,2,2,3,0,1,3,2,2,1,6,8,26,1,1,42.6289367675781,19.3448066711426,40,29,12,10,11,0,1,4,1,4,1,77,0,"heroin","white"
87,1,0,3,51.0739669799805,53.4364700317383,21,88,0,6,1,,,,,,,,,,,,0,1,19.7357559204102,51.1424102783203,20,50,0,8,1,1,0,,64.7021179199219,13.2848768234253,38,74,0,8,1,0,0,1,1,1,2,3,0,2,1,0,0,2,0,1,0,0,1,0,0,0,2,1,1,0,1,1,35,1,0,59.567081451416,26.2219676971436,29,42,1,0,7,0,1,47,1,47,1,35,0,"cocaine","black"